{"text_format":"1","workbook":"xlsx","n_sheets":4,"sheets":["Поступки","Расписание","Часы","Справка"],"not_rendered":{"charts":0,"images":31,"macros":1,"external_links":0,"defined_names":59,"comments":2,"pivot_tables":0},"unopened":[],"bounds":{"document_bytes":16777216,"sheet_cells":100000,"rows_first":2000,"rows_last":500,"rows_between":2000,"halvings":0,"cell_chars":16384,"cell_head_chars":4096},"cells_cut":0,"cells_raw":0,"read":"whole","date_system":"1900"}

{"sheet":"Поступки","index":0,"n_rows":100,"n_cols":18,"rows_kept":100,"cut":false,"hidden":false,"merged":[[1,6,1,13]]}
[null,"Задания!A1",null,null,null,null,"здоровье","    быт","близкие","общество","   игра","  учёба","  труд","признание","методобъединение 13:00",null,""]
["ПОТРЕБНОСТЬ","РАЗДРАЖИТЕЛЬ","ОБРАБОТКА","САМООЦЕНКА","ЧУВСТВО","ДЕЙСТВИЯ","ССЫЛКИ/ПОДЗАДАЧИ",null,null,null,null,null,null,null,"ЗА","ПРОТИВ","Поступок","День"]
["ТРУД"]
[]
[]
[]
[]
[]
[]
[]
{"$rows_left_out":91}
{"sheet":"Расписание","index":1,"n_rows":68,"n_cols":28,"rows_kept":68,"cut":false,"hidden":false,"merged":[]}
["00:01:03",null,null,"Январь",null,2019,null,null,null,null,null,null,null,null,"новошахтинск театр"]
[null,"ПОНЕДЕЛЬНИК","ВТОРНИК","СРЕДА","ЧЕТВЕРГ","ПЯТНИЦА","СУББОТА","ВОСКРЕСЕНЬЕ"]
[null,{"$f":"IF(WEEKDAY(DATEVALUE(\" 1\"&МесМесяц&МесГод)-1)=COLUMN(A$1),1,IF(LEN(A3)>0,A3+1,\"\"))","v":""},1,2,{"$f":"IF(WEEKDAY(DATEVALUE(\" 1\"&МесМесяц&МесГод)-1)=COLUMN(D$1),1,IF(LEN(D3)>0,D3+1,\"\"))","v":3},4,5,6]
[null,{"$f":"IF(ISERR(INDEX(Поступки!$Q$2:$R$612,SMALL(IF(DATE(МесГод,МесНомерМесяца,B3)=Поступки!$R$3:$R$607,ROW(Поступки!$R$3:$R$607)-1),ROW($A$1)),1)),\"\",INDEX(Поступки!$Q$2:$R$612,SMALL(IF(DATE(МесГод,МесНомерМесяца,B3)=Поступки!$R$3:$R$607,ROW(Поступки!$R$3:$R$607)-1),ROW($A$1)),1))","v":""},{"$f":"IF(ISERR(INDEX(Поступки!$Q$2:$R$612,SMALL(IF(DATE(МесГод,МесНомерМесяца,C3)=Поступки!$R$3:$R$607,ROW(Поступки!$R$3:$R$607)-1),ROW($A$1)),1)),\"\",INDEX(Поступки!$Q$2:$R$612,SMALL(IF(DATE(МесГод,МесНомерМесяца,C3)=Поступки!$R$3:$R$607,ROW(Поступки!$R$3:$R$607)-1),ROW($A$1)),1))","v":""},{"$f":"IF(ISERR(INDEX(Поступки!$Q$2:$R$612,SMALL(IF(DATE(МесГод,МесНомерМесяца,D3)=Поступки!$R$3:$R$607,ROW(Поступки!$R$3:$R$607)-1),ROW($A$1)),1)),\"\",INDEX(Поступки!$Q$2:$R$612,SMALL(IF(DATE(МесГод,МесНомерМесяца,D3)=Поступки!$R$3:$R$607,ROW(Поступки!$R$3:$R$607)-1),ROW($A$1)),1))","v":""},{"$f":"IF(ISERR(INDEX(Поступки!$Q$2:$R$612,SMALL(IF(DATE(МесГод,МесНомерМесяца,E3)=Поступки!$R$3:$R$607,ROW(Поступки!$R$3:$R$607)-1),ROW($A$1)),1)),\"\",INDEX(Поступки!$Q$2:$R$612,SMALL(IF(DATE(МесГод,МесНомерМесяца,E3)=Поступки!$R$3:$R$607,ROW(Поступки!$R$3:$R$607)-1),ROW($A$1)),1))","v":""},{"$f":"IF(ISERR(INDEX(Поступки!$Q$2:$R$612,SMALL(IF(DATE(МесГод,МесНомерМесяца,F3)=Поступки!$R$3:$R$607,ROW(Поступки!$R$3:$R$607)-1),ROW($A$1)),1)),\"\",INDEX(Поступки!$Q$2:$R$612,SMALL(IF(DATE(МесГод,МесНомерМесяца,F3)=Поступки!$R$3:$R$607,ROW(Поступки!$R$3:$R$607)-1),ROW($A$1)),1))","v":""},{"$f":"IF(ISERR(INDEX(Поступки!$Q$2:$R$612,SMALL(IF(DATE(МесГод,МесНомерМесяца,G3)=Поступки!$R$3:$R$607,ROW(Поступки!$R$3:$R$607)-1),ROW($A$1)),1)),\"\",INDEX(Поступки!$Q$2:$R$612,SMALL(IF(DATE(МесГод,МесНомерМесяца,G3)=Поступки!$R$3:$R$607,ROW(Поступки!$R$3:$R$607)-1),ROW($A$1)),1))","v":""},{"$f":"IF(ISERR(INDEX(Поступки!$Q$2:$R$612,SMALL(IF(DATE(МесГод,МесНомерМесяца,H3)=Поступки!$R$3:$R$607,ROW(Поступки!$R$3:$R$607)-1),ROW($A$1)),1)),\"\",INDEX(Поступки!$Q$2:$R$612,SMALL(IF(DATE(МесГод,МесНомерМесяца,H3)=Поступки!$R$3:$R$607,ROW(Поступки!$R$3:$R$607)-1),ROW($A$1)),1))","v":""}]
[null,{"$f":"IF(ISERR(INDEX(Поступки!$Q$2:$R$612,SMALL(IF(DATE(МесГод,МесНомерМесяца,B3)=Поступки!$R$3:$R$607,ROW(Поступки!$R$3:$R$607)-1),ROW($A$2)),1)),\"\",INDEX(Поступки!$Q$2:$R$612,SMALL(IF(DATE(МесГод,МесНомерМесяца,B3)=Поступки!$R$3:$R$607,ROW(Поступки!$R$3:$R$607)-1),ROW($A$2)),1))","v":""},{"$f":"IF(ISERR(INDEX(Поступки!$Q$2:$R$612,SMALL(IF(DATE(МесГод,МесНомерМесяца,C3)=Поступки!$R$3:$R$607,ROW(Поступки!$R$3:$R$607)-1),ROW($A$2)),1)),\"\",INDEX(Поступки!$Q$2:$R$612,SMALL(IF(DATE(МесГод,МесНомерМесяца,C3)=Поступки!$R$3:$R$607,ROW(Поступки!$R$3:$R$607)-1),ROW($A$2)),1))","v":""},{"$f":"IF(ISERR(INDEX(Поступки!$Q$2:$R$612,SMALL(IF(DATE(МесГод,МесНомерМесяца,D3)=Поступки!$R$3:$R$607,ROW(Поступки!$R$3:$R$607)-1),ROW($A$2)),1)),\"\",INDEX(Поступки!$Q$2:$R$612,SMALL(IF(DATE(МесГод,МесНомерМесяца,D3)=Поступки!$R$3:$R$607,ROW(Поступки!$R$3:$R$607)-1),ROW($A$2)),1))","v":""},{"$f":"IF(ISERR(INDEX(Поступки!$Q$2:$R$612,SMALL(IF(DATE(МесГод,МесНомерМесяца,E3)=Поступки!$R$3:$R$607,ROW(Поступки!$R$3:$R$607)-1),ROW($A$2)),1)),\"\",INDEX(Поступки!$Q$2:$R$612,SMALL(IF(DATE(МесГод,МесНомерМесяца,E3)=Поступки!$R$3:$R$607,ROW(Поступки!$R$3:$R$607)-1),ROW($A$2)),1))","v":""},{"$f":"IF(ISERR(INDEX(Поступки!$Q$2:$R$612,SMALL(IF(DATE(МесГод,МесНомерМесяца,F3)=Поступки!$R$3:$R$607,ROW(Поступки!$R$3:$R$607)-1),ROW($A$2)),1)),\"\",INDEX(Поступки!$Q$2:$R$612,SMALL(IF(DATE(МесГод,МесНомерМесяца,F3)=Поступки!$R$3:$R$607,ROW(Поступки!$R$3:$R$607)-1),ROW($A$2)),1))","v":""},{"$f":"IF(ISERR(INDEX(Поступки!$Q$2:$R$612,SMALL(IF(DATE(МесГод,МесНомерМесяца,G3)=Поступки!$R$3:$R$607,ROW(Поступки!$R$3:$R$607)-1),ROW($A$2)),1)),\"\",INDEX(Поступки!$Q$2:$R$612,SMALL(IF(DATE(МесГод,МесНомерМесяца,G3)=Поступки!$R$3:$R$607,ROW(Поступки!$R$3:$R$607)-1),ROW($A$2)),1))","v":""},{"$f":"IF(ISERR(INDEX(Поступки!$Q$2:$R$612,SMALL(IF(DATE(МесГод,МесНомерМесяца,H3)=Поступки!$R$3:$R$607,ROW(Поступки!$R$3:$R$607)-1),ROW($A$2)),1)),\"\",INDEX(Поступки!$Q$2:$R$612,SMALL(IF(DATE(МесГод,МесНомерМесяца,H3)=Поступки!$R$3:$R$607,ROW(Поступки!$R$3:$R$607)-1),ROW($A$2)),1))","v":""}]
[null,{"$f":"IF(ISERR(INDEX(Поступки!$Q$2:$R$612,SMALL(IF(DATE(МесГод,МесНомерМесяца,B3)=Поступки!$R$3:$R$607,ROW(Поступки!$R$3:$R$607)-1),ROW($A$3)),1)),\"\",INDEX(Поступки!$Q$2:$R$612,SMALL(IF(DATE(МесГод,МесНомерМесяца,B3)=Поступки!$R$3:$R$607,ROW(Поступки!$R$3:$R$607)-1),ROW($A$3)),1))","v":""},{"$f":"IF(ISERR(INDEX(Поступки!$Q$2:$R$612,SMALL(IF(DATE(МесГод,МесНомерМесяца,C3)=Поступки!$R$3:$R$607,ROW(Поступки!$R$3:$R$607)-1),ROW($A$3)),1)),\"\",INDEX(Поступки!$Q$2:$R$612,SMALL(IF(DATE(МесГод,МесНомерМесяца,C3)=Поступки!$R$3:$R$607,ROW(Поступки!$R$3:$R$607)-1),ROW($A$3)),1))","v":""},{"$f":"IF(ISERR(INDEX(Поступки!$Q$2:$R$612,SMALL(IF(DATE(МесГод,МесНомерМесяца,D3)=Поступки!$R$3:$R$607,ROW(Поступки!$R$3:$R$607)-1),ROW($A$3)),1)),\"\",INDEX(Поступки!$Q$2:$R$612,SMALL(IF(DATE(МесГод,МесНомерМесяца,D3)=Поступки!$R$3:$R$607,ROW(Поступки!$R$3:$R$607)-1),ROW($A$3)),1))","v":""},{"$f":"IF(ISERR(INDEX(Поступки!$Q$2:$R$612,SMALL(IF(DATE(МесГод,МесНомерМесяца,E3)=Поступки!$R$3:$R$607,ROW(Поступки!$R$3:$R$607)-1),ROW($A$3)),1)),\"\",INDEX(Поступки!$Q$2:$R$612,SMALL(IF(DATE(МесГод,МесНомерМесяца,E3)=Поступки!$R$3:$R$607,ROW(Поступки!$R$3:$R$607)-1),ROW($A$3)),1))","v":""},{"$f":"IF(ISERR(INDEX(Поступки!$Q$2:$R$612,SMALL(IF(DATE(МесГод,МесНомерМесяца,F3)=Поступки!$R$3:$R$607,ROW(Поступки!$R$3:$R$607)-1),ROW($A$3)),1)),\"\",INDEX(Поступки!$Q$2:$R$612,SMALL(IF(DATE(МесГод,МесНомерМесяца,F3)=Поступки!$R$3:$R$607,ROW(Поступки!$R$3:$R$607)-1),ROW($A$3)),1))","v":""},{"$f":"IF(ISERR(INDEX(Поступки!$Q$2:$R$612,SMALL(IF(DATE(МесГод,МесНомерМесяца,G3)=Поступки!$R$3:$R$607,ROW(Поступки!$R$3:$R$607)-1),ROW($A$3)),1)),\"\",INDEX(Поступки!$Q$2:$R$612,SMALL(IF(DATE(МесГод,МесНомерМесяца,G3)=Поступки!$R$3:$R$607,ROW(Поступки!$R$3:$R$607)-1),ROW($A$3)),1))","v":""},{"$f":"IF(ISERR(INDEX(Поступки!$Q$2:$R$612,SMALL(IF(DATE(МесГод,МесНомерМесяца,H3)=Поступки!$R$3:$R$607,ROW(Поступки!$R$3:$R$607)-1),ROW($A$3)),1)),\"\",INDEX(Поступки!$Q$2:$R$612,SMALL(IF(DATE(МесГод,МесНомерМесяца,H3)=Поступки!$R$3:$R$607,ROW(Поступки!$R$3:$R$607)-1),ROW($A$3)),1))","v":""}]
[null,{"$f":"IF(ISERR(INDEX(Поступки!$Q$2:$R$612,SMALL(IF(DATE(МесГод,МесНомерМесяца,B3)=Поступки!$R$3:$R$607,ROW(Поступки!$R$3:$R$607)-1),ROW($A$4)),1)),\"\",INDEX(Поступки!$Q$2:$R$612,SMALL(IF(DATE(МесГод,МесНомерМесяца,B3)=Поступки!$R$3:$R$607,ROW(Поступки!$R$3:$R$607)-1),ROW($A$4)),1))","v":""},{"$f":"IF(ISERR(INDEX(Поступки!$Q$2:$R$612,SMALL(IF(DATE(МесГод,МесНомерМесяца,C3)=Поступки!$R$3:$R$607,ROW(Поступки!$R$3:$R$607)-1),ROW($A$4)),1)),\"\",INDEX(Поступки!$Q$2:$R$612,SMALL(IF(DATE(МесГод,МесНомерМесяца,C3)=Поступки!$R$3:$R$607,ROW(Поступки!$R$3:$R$607)-1),ROW($A$4)),1))","v":""},{"$f":"IF(ISERR(INDEX(Поступки!$Q$2:$R$612,SMALL(IF(DATE(МесГод,МесНомерМесяца,D3)=Поступки!$R$3:$R$607,ROW(Поступки!$R$3:$R$607)-1),ROW($A$4)),1)),\"\",INDEX(Поступки!$Q$2:$R$612,SMALL(IF(DATE(МесГод,МесНомерМесяца,D3)=Поступки!$R$3:$R$607,ROW(Поступки!$R$3:$R$607)-1),ROW($A$4)),1))","v":""},{"$f":"IF(ISERR(INDEX(Поступки!$Q$2:$R$612,SMALL(IF(DATE(МесГод,МесНомерМесяца,E3)=Поступки!$R$3:$R$607,ROW(Поступки!$R$3:$R$607)-1),ROW($A$4)),1)),\"\",INDEX(Поступки!$Q$2:$R$612,SMALL(IF(DATE(МесГод,МесНомерМесяца,E3)=Поступки!$R$3:$R$607,ROW(Поступки!$R$3:$R$607)-1),ROW($A$4)),1))","v":""},{"$f":"IF(ISERR(INDEX(Поступки!$Q$2:$R$612,SMALL(IF(DATE(МесГод,МесНомерМесяца,F3)=Поступки!$R$3:$R$607,ROW(Поступки!$R$3:$R$607)-1),ROW($A$4)),1)),\"\",INDEX(Поступки!$Q$2:$R$612,SMALL(IF(DATE(МесГод,МесНомерМесяца,F3)=Поступки!$R$3:$R$607,ROW(Поступки!$R$3:$R$607)-1),ROW($A$4)),1))","v":""},{"$f":"IF(ISERR(INDEX(Поступки!$Q$2:$R$612,SMALL(IF(DATE(МесГод,МесНомерМесяца,G3)=Поступки!$R$3:$R$607,ROW(Поступки!$R$3:$R$607)-1),ROW($A$4)),1)),\"\",INDEX(Поступки!$Q$2:$R$612,SMALL(IF(DATE(МесГод,МесНомерМесяца,G3)=Поступки!$R$3:$R$607,ROW(Поступки!$R$3:$R$607)-1),ROW($A$4)),1))","v":""},{"$f":"IF(ISERR(INDEX(Поступки!$Q$2:$R$612,SMALL(IF(DATE(МесГод,МесНомерМесяца,H3)=Поступки!$R$3:$R$607,ROW(Поступки!$R$3:$R$607)-1),ROW($A$4)),1)),\"\",INDEX(Поступки!$Q$2:$R$612,SMALL(IF(DATE(МесГод,МесНомерМесяца,H3)=Поступки!$R$3:$R$607,ROW(Поступки!$R$3:$R$607)-1),ROW($A$4)),1))","v":""}]
[null,{"$f":"IF(ISERR(INDEX(Поступки!$Q$2:$R$612,SMALL(IF(DATE(МесГод,МесНомерМесяца,B3)=Поступки!$R$3:$R$607,ROW(Поступки!$R$3:$R$607)-1),ROW($A$5)),1)),\"\",INDEX(Поступки!$Q$2:$R$612,SMALL(IF(DATE(МесГод,МесНомерМесяца,B3)=Поступки!$R$3:$R$607,ROW(Поступки!$R$3:$R$607)-1),ROW($A$5)),1))","v":""},{"$f":"IF(ISERR(INDEX(Поступки!$Q$2:$R$612,SMALL(IF(DATE(МесГод,МесНомерМесяца,C3)=Поступки!$R$3:$R$607,ROW(Поступки!$R$3:$R$607)-1),ROW($A$5)),1)),\"\",INDEX(Поступки!$Q$2:$R$612,SMALL(IF(DATE(МесГод,МесНомерМесяца,C3)=Поступки!$R$3:$R$607,ROW(Поступки!$R$3:$R$607)-1),ROW($A$5)),1))","v":""},{"$f":"IF(ISERR(INDEX(Поступки!$Q$2:$R$612,SMALL(IF(DATE(МесГод,МесНомерМесяца,D3)=Поступки!$R$3:$R$607,ROW(Поступки!$R$3:$R$607)-1),ROW($A$5)),1)),\"\",INDEX(Поступки!$Q$2:$R$612,SMALL(IF(DATE(МесГод,МесНомерМесяца,D3)=Поступки!$R$3:$R$607,ROW(Поступки!$R$3:$R$607)-1),ROW($A$5)),1))","v":""},{"$f":"IF(ISERR(INDEX(Поступки!$Q$2:$R$612,SMALL(IF(DATE(МесГод,МесНомерМесяца,E3)=Поступки!$R$3:$R$607,ROW(Поступки!$R$3:$R$607)-1),ROW($A$5)),1)),\"\",INDEX(Поступки!$Q$2:$R$612,SMALL(IF(DATE(МесГод,МесНомерМесяца,E3)=Поступки!$R$3:$R$607,ROW(Поступки!$R$3:$R$607)-1),ROW($A$5)),1))","v":""},{"$f":"IF(ISERR(INDEX(Поступки!$Q$2:$R$612,SMALL(IF(DATE(МесГод,МесНомерМесяца,F3)=Поступки!$R$3:$R$607,ROW(Поступки!$R$3:$R$607)-1),ROW($A$5)),1)),\"\",INDEX(Поступки!$Q$2:$R$612,SMALL(IF(DATE(МесГод,МесНомерМесяца,F3)=Поступки!$R$3:$R$607,ROW(Поступки!$R$3:$R$607)-1),ROW($A$5)),1))","v":""},{"$f":"IF(ISERR(INDEX(Поступки!$Q$2:$R$612,SMALL(IF(DATE(МесГод,МесНомерМесяца,G3)=Поступки!$R$3:$R$607,ROW(Поступки!$R$3:$R$607)-1),ROW($A$5)),1)),\"\",INDEX(Поступки!$Q$2:$R$612,SMALL(IF(DATE(МесГод,МесНомерМесяца,G3)=Поступки!$R$3:$R$607,ROW(Поступки!$R$3:$R$607)-1),ROW($A$5)),1))","v":""},{"$f":"IF(ISERR(INDEX(Поступки!$Q$2:$R$612,SMALL(IF(DATE(МесГод,МесНомерМесяца,H3)=Поступки!$R$3:$R$607,ROW(Поступки!$R$3:$R$607)-1),ROW($A$5)),1)),\"\",INDEX(Поступки!$Q$2:$R$612,SMALL(IF(DATE(МесГод,МесНомерМесяца,H3)=Поступки!$R$3:$R$607,ROW(Поступки!$R$3:$R$607)-1),ROW($A$5)),1))","v":""}]
[null,{"$f":"IF(ISERR(INDEX(Поступки!$Q$2:$R$612,SMALL(IF(DATE(МесГод,МесНомерМесяца,B3)=Поступки!$R$3:$R$607,ROW(Поступки!$R$3:$R$607)-1),ROW($A$6)),1)),\"\",INDEX(Поступки!$Q$2:$R$612,SMALL(IF(DATE(МесГод,МесНомерМесяца,B3)=Поступки!$R$3:$R$607,ROW(Поступки!$R$3:$R$607)-1),ROW($A$6)),1))","v":""},{"$f":"IF(ISERR(INDEX(Поступки!$Q$2:$R$612,SMALL(IF(DATE(МесГод,МесНомерМесяца,C3)=Поступки!$R$3:$R$607,ROW(Поступки!$R$3:$R$607)-1),ROW($A$6)),1)),\"\",INDEX(Поступки!$Q$2:$R$612,SMALL(IF(DATE(МесГод,МесНомерМесяца,C3)=Поступки!$R$3:$R$607,ROW(Поступки!$R$3:$R$607)-1),ROW($A$6)),1))","v":""},{"$f":"IF(ISERR(INDEX(Поступки!$Q$2:$R$612,SMALL(IF(DATE(МесГод,МесНомерМесяца,D3)=Поступки!$R$3:$R$607,ROW(Поступки!$R$3:$R$607)-1),ROW($A$6)),1)),\"\",INDEX(Поступки!$Q$2:$R$612,SMALL(IF(DATE(МесГод,МесНомерМесяца,D3)=Поступки!$R$3:$R$607,ROW(Поступки!$R$3:$R$607)-1),ROW($A$6)),1))","v":""},{"$f":"IF(ISERR(INDEX(Поступки!$Q$2:$R$612,SMALL(IF(DATE(МесГод,МесНомерМесяца,E3)=Поступки!$R$3:$R$607,ROW(Поступки!$R$3:$R$607)-1),ROW($A$6)),1)),\"\",INDEX(Поступки!$Q$2:$R$612,SMALL(IF(DATE(МесГод,МесНомерМесяца,E3)=Поступки!$R$3:$R$607,ROW(Поступки!$R$3:$R$607)-1),ROW($A$6)),1))","v":""},{"$f":"IF(ISERR(INDEX(Поступки!$Q$2:$R$612,SMALL(IF(DATE(МесГод,МесНомерМесяца,F3)=Поступки!$R$3:$R$607,ROW(Поступки!$R$3:$R$607)-1),ROW($A$6)),1)),\"\",INDEX(Поступки!$Q$2:$R$612,SMALL(IF(DATE(МесГод,МесНомерМесяца,F3)=Поступки!$R$3:$R$607,ROW(Поступки!$R$3:$R$607)-1),ROW($A$6)),1))","v":""},{"$f":"IF(ISERR(INDEX(Поступки!$Q$2:$R$612,SMALL(IF(DATE(МесГод,МесНомерМесяца,G3)=Поступки!$R$3:$R$607,ROW(Поступки!$R$3:$R$607)-1),ROW($A$6)),1)),\"\",INDEX(Поступки!$Q$2:$R$612,SMALL(IF(DATE(МесГод,МесНомерМесяца,G3)=Поступки!$R$3:$R$607,ROW(Поступки!$R$3:$R$607)-1),ROW($A$6)),1))","v":""},{"$f":"IF(ISERR(INDEX(Поступки!$Q$2:$R$612,SMALL(IF(DATE(МесГод,МесНомерМесяца,H3)=Поступки!$R$3:$R$607,ROW(Поступки!$R$3:$R$607)-1),ROW($A$6)),1)),\"\",INDEX(Поступки!$Q$2:$R$612,SMALL(IF(DATE(МесГод,МесНомерМесяца,H3)=Поступки!$R$3:$R$607,ROW(Поступки!$R$3:$R$607)-1),ROW($A$6)),1))","v":""}]
[null,{"$f":"IF(ISERR(INDEX(Поступки!$Q$2:$R$612,SMALL(IF(DATE(МесГод,МесНомерМесяца,B3)=Поступки!$R$3:$R$607,ROW(Поступки!$R$3:$R$607)-1),ROW($A$7)),1)),\"\",INDEX(Поступки!$Q$2:$R$612,SMALL(IF(DATE(МесГод,МесНомерМесяца,B3)=Поступки!$R$3:$R$607,ROW(Поступки!$R$3:$R$607)-1),ROW($A$7)),1))","v":""},{"$f":"IF(ISERR(INDEX(Поступки!$Q$2:$R$612,SMALL(IF(DATE(МесГод,МесНомерМесяца,C3)=Поступки!$R$3:$R$607,ROW(Поступки!$R$3:$R$607)-1),ROW($A$7)),1)),\"\",INDEX(Поступки!$Q$2:$R$612,SMALL(IF(DATE(МесГод,МесНомерМесяца,C3)=Поступки!$R$3:$R$607,ROW(Поступки!$R$3:$R$607)-1),ROW($A$7)),1))","v":""},{"$f":"IF(ISERR(INDEX(Поступки!$Q$2:$R$612,SMALL(IF(DATE(МесГод,МесНомерМесяца,D3)=Поступки!$R$3:$R$607,ROW(Поступки!$R$3:$R$607)-1),ROW($A$7)),1)),\"\",INDEX(Поступки!$Q$2:$R$612,SMALL(IF(DATE(МесГод,МесНомерМесяца,D3)=Поступки!$R$3:$R$607,ROW(Поступки!$R$3:$R$607)-1),ROW($A$7)),1))","v":""},{"$f":"IF(ISERR(INDEX(Поступки!$Q$2:$R$612,SMALL(IF(DATE(МесГод,МесНомерМесяца,E3)=Поступки!$R$3:$R$607,ROW(Поступки!$R$3:$R$607)-1),ROW($A$7)),1)),\"\",INDEX(Поступки!$Q$2:$R$612,SMALL(IF(DATE(МесГод,МесНомерМесяца,E3)=Поступки!$R$3:$R$607,ROW(Поступки!$R$3:$R$607)-1),ROW($A$7)),1))","v":""},{"$f":"IF(ISERR(INDEX(Поступки!$Q$2:$R$612,SMALL(IF(DATE(МесГод,МесНомерМесяца,F3)=Поступки!$R$3:$R$607,ROW(Поступки!$R$3:$R$607)-1),ROW($A$7)),1)),\"\",INDEX(Поступки!$Q$2:$R$612,SMALL(IF(DATE(МесГод,МесНомерМесяца,F3)=Поступки!$R$3:$R$607,ROW(Поступки!$R$3:$R$607)-1),ROW($A$7)),1))","v":""},{"$f":"IF(ISERR(INDEX(Поступки!$Q$2:$R$612,SMALL(IF(DATE(МесГод,МесНомерМесяца,G3)=Поступки!$R$3:$R$607,ROW(Поступки!$R$3:$R$607)-1),ROW($A$7)),1)),\"\",INDEX(Поступки!$Q$2:$R$612,SMALL(IF(DATE(МесГод,МесНомерМесяца,G3)=Поступки!$R$3:$R$607,ROW(Поступки!$R$3:$R$607)-1),ROW($A$7)),1))","v":""},{"$f":"IF(ISERR(INDEX(Поступки!$Q$2:$R$612,SMALL(IF(DATE(МесГод,МесНомерМесяца,H3)=Поступки!$R$3:$R$607,ROW(Поступки!$R$3:$R$607)-1),ROW($A$7)),1)),\"\",INDEX(Поступки!$Q$2:$R$612,SMALL(IF(DATE(МесГод,МесНомерМесяца,H3)=Поступки!$R$3:$R$607,ROW(Поступки!$R$3:$R$607)-1),ROW($A$7)),1))","v":""}]
{"$rows_left_out":59}
{"sheet":"Часы","index":2,"n_rows":9997,"n_cols":23,"rows_kept":9997,"cut":false,"hidden":false,"merged":[]}
[null,"2018-12-31",null,{"$f":"B1+1","v":"2019-01-01"},null,{"$f":"D1+1","v":"2019-01-02"},null,{"$f":"F1+1","v":"2019-01-03"},null,{"$f":"H1+1","v":"2019-01-04"},null,{"$f":"J1+1","v":"2019-01-05"},null,{"$f":"L1+1","v":"2019-01-06"},null,"час","доля",null,"весь год","доля",null,null,{"$f":"IFERROR(INDEX(M$10001:M$11010,SMALL(IF(M$10001:M$11010<>\"\",$AC$1:$AC$1010),ROW(B1))),\"\")","v":""}]
["здоровье",null,null,null,null,null,null,null,null,null,null,null,null,null,null,{"$f":"SUM(B2:O2)","v":0},{"$f":"SUM(B2:O2)*100/SUM(B2:O9)","v":{"$error":"#DIV/0!"}},null,"здоровье",{"$f":"SUM(P2,P11,P20,P29,P38,P47,P56,P65,P74,P83,P92,P101,P110,P119,P128,P137,P146,P155,P164,P173,P182,P191,P200,P209,P218,P227,P236,P245,P254,P263,P272,P281,P290,P299,P308,P317,P326,P335,P344,P353,P362,P371,P380,P389,P398,P407,P416,P425,P434,P443,P452,P461,P470)*100/SUM(P:P)","v":{"$error":"#DIV/0!"}}]
["быт",null,null,null,null,null,null,null,null,null,null,null,null,null,null,0,{"$f":"SUM(B3:O3)*100/SUM(B2:O9)","v":{"$error":"#DIV/0!"}},null,"быт",{"$error":"#DIV/0!"}]
["близкие",null,null,null,null,null,null,null,null,null,null,null,null,null,null,0,{"$f":"SUM(B4:O4)*100/SUM(B2:O9)","v":{"$error":"#DIV/0!"}},null,"близкие",{"$error":"#DIV/0!"}]
["общество",null,null,null,null,null,null,null,null,null,null,null,null,null,null,0,{"$f":"SUM(B5:O5)*100/SUM(B2:O9)","v":{"$error":"#DIV/0!"}},null,"общество",{"$error":"#DIV/0!"}]
["игра",null,null,null,null,null,null,null,null,null,null,null,null,null,null,0,{"$f":"SUM(B6:O6)*100/SUM(B2:O9)","v":{"$error":"#DIV/0!"}},null,"игра",{"$error":"#DIV/0!"}]
["учёба",null,null,null,null,null,null,null,null,null,null,null,null,null,null,0,{"$f":"SUM(B7:O7)*100/SUM(B2:O9)","v":{"$error":"#DIV/0!"}},null,"учёба",{"$error":"#DIV/0!"}]
["труд",null,null,null,null,null,null,null,null,null,null,null,null,null,null,0,{"$f":"SUM(B8:O8)*100/SUM(B2:O9)","v":{"$error":"#DIV/0!"}},null,"труд",{"$error":"#DIV/0!"}]
["признание",null,null,null,null,null,null,null,null,null,null,null,null,null,null,0,{"$f":"SUM(B9:O9)*100/SUM(B2:O9)","v":{"$error":"#DIV/0!"}},null,"признание",{"$error":"#DIV/0!"}]
[null,{"$f":"N1+1","v":"2019-01-07"},null,{"$f":"B10+1","v":"2019-01-08"},null,{"$f":"D10+1","v":"2019-01-09"},null,{"$f":"F10+1","v":"2019-01-10"},null,{"$f":"H10+1","v":"2019-01-11"},null,{"$f":"J10+1","v":"2019-01-12"},null,{"$f":"L10+1","v":"2019-01-13"}]
{"$rows_left_out":9988}
{"sheet":"Справка","index":3,"n_rows":69,"n_cols":4,"rows_kept":69,"cut":false,"hidden":false,"merged":[[63,1,63,3],[38,0,38,6],[14,1,14,5],[15,1,15,5],[13,1,13,5],[1,3,1,4],[4,1,4,6],[5,1,5,6],[6,1,6,6],[2,1,2,6]]}
[]
[null,null,null,"Поведневник "]
[null,"(поведнéвник, поведенческий ежедневник) "]
[]
[null,"новый вид ежедневника, который вбирает в себя "]
[null,"различные возможности, выработанные "]
[null,"науками о поведении и управлении."]
[]
[]
[]
{"$rows_left_out":59}